ComSer Forum
Welcome, Guest. Please login or register.
August 15, 2018, 06:21:14 PM

Login with username, password and session length
Search:     Advanced search
Try Haxball - www.haxball.com
8133 Posts in 708 Topics by 253 Members
Latest Member: Maxigenzztop
* Home Help Search Calendar Login Register
+  ComSer Forum
|-+  Gusanos Forum
| |-+  Gusanos News
| | |-+  Gusanos .9c released!
0 Members and 1 Guest are viewing this topic. « previous next »
Pages: [1] 2 3 4 5 ... 7 Go Down Print
Author Topic: Gusanos .9c released!  (Read 75396 times)
Gliptic
Gusanos Team
Veteran Member
*****

Karma: 8
Offline Offline

Posts: 208


View Profile
« on: January 31, 2006, 12:26:52 PM »

The long awaited Gusanos .9c is finally released!
This is mostly a bugfixing version but there's a few great new features such as automatic map downloading from servers. Read the ChangeLog to find out exactly what has changed.
NOTE: Modders should look carefully at the "Backwards compatibility issues" section in the ChangeLog because there's a few things that has to be changed in all .9b mods. This means mods done for 0.9b wont work correctly on 0.9c untill modders update their respective mods.

Download from any of these places:
Sourceforge: http://prdownloads.sourceforge.net/gusanos/gusanos-0.9c.zip?download
Setrodox: http://powerhuhn.net/depot/gusanos/gusanos/gusanos-0.9c.zip
Podex: http://home.isp.studenten.net/caissa/d11/gusanos-0.9c.zip
« Last Edit: January 31, 2006, 05:09:03 PM by Gliptic » Logged
Podex
Koen Verweij
Veteran Member
****

Karma: 9
Offline Offline

Posts: 211


ÜberLlama


View Profile WWW
« Reply #1 on: January 31, 2006, 05:08:12 PM »

Nicely done. Thank you very much for a most enjoyable game basara and Gliptic.
Logged

D11 F2
sindalf
Veteran Member
****

Karma: 8
Offline Offline

Posts: 264


Further than beyond...ProjectX


View Profile
« Reply #2 on: February 01, 2006, 12:09:52 AM »

 Cheesy great work
Logged
sharkyx
Jr. Member
*

Karma: 1
Offline Offline

Posts: 27


View Profile WWW
« Reply #3 on: February 01, 2006, 01:34:19 PM »

sweetness! no more words.. need to play
Logged
Dflies
you win nothing >:D
Sr. Member
***

Karma: 0
Offline Offline

Posts: 85


Oh bravo, what do i win?


View Profile WWW
« Reply #4 on: February 02, 2006, 10:56:58 AM »

Yahahay, when the mods are updated, I'm gonna spread this sexyness!
Logged

Meh..
MazeMasterz
Member
**

Karma: 1
Offline Offline

Posts: 35


View Profile
« Reply #5 on: February 02, 2006, 07:37:23 PM »

Nice, I really like the whole local play thing Cheesy
Logged
mots
Sr. Member
***

Karma: 0
Offline Offline

Posts: 73



View Profile
« Reply #6 on: February 03, 2006, 11:48:21 PM »

How about "other platforms"? (Buh, Linux User!)
Logged
setrodox
I am NOT pink!
Hero Member
*****

Karma: 34
Offline Offline

Posts: 336



View Profile
« Reply #7 on: February 04, 2006, 12:07:53 AM »

for linux: http://gusanos.sourceforge.net/docs/doku.php?id=main:installation_docs:linux
use zoidcom 0.6.1 instead though, as the docs aren't updated for .9c
other platforms than linux and windows aren't available because zoidcom is properitary and only available for that two platforms.
Logged

PINK!
mots
Sr. Member
***

Karma: 0
Offline Offline

Posts: 73



View Profile
« Reply #8 on: February 04, 2006, 11:59:20 PM »

No precompiled files? (/me is lazy...)
Logged
setrodox
I am NOT pink!
Hero Member
*****

Karma: 34
Offline Offline

Posts: 336



View Profile
« Reply #9 on: February 05, 2006, 01:14:11 AM »

no
Logged

PINK!
mots
Sr. Member
***

Karma: 0
Offline Offline

Posts: 73



View Profile
« Reply #10 on: March 18, 2006, 12:57:46 AM »

EDIT: Tried to compile it and got:
Code:
root@nonsense:/home/mots/gusanos-0.9# scons
scons: Reading SConscript files ...
Configuring...
Checking for main() in C++ library boost_filesystem-gcc... yes
Checking for main() in C++ library boost_signals-gcc... yes
Checking for main() in C++ library fmod-3.74.1... yes
Checking for main() in C++ library png13... no
Checking for main() in C++ library png12... yes
Checking for main() in C++ library zoidcom... yes
Checking for main() in C++ library z... no
Could not locate library z or any variant
What the Hell is "z"? And where do I get it?
Logged
setrodox
I am NOT pink!
Hero Member
*****

Karma: 34
Offline Offline

Posts: 336



View Profile
« Reply #11 on: March 18, 2006, 01:08:28 AM »

i think that lib 'z' is the zlib. try to install a package named libz-dev, zlib-dev, libzlib-dev or sth like that
Logged

PINK!
mots
Sr. Member
***

Karma: 0
Offline Offline

Posts: 73



View Profile
« Reply #12 on: March 18, 2006, 01:18:09 AM »

thx, zlib1g did it. But now I need png.h...
where do I get this dumb header?
Code:
root@nonsense:/home/mots/gusanos-0.9# scons
scons: Reading SConscript files ...
Configuring...
Checking for main() in C++ library boost_filesystem-gcc... yes
Checking for main() in C++ library boost_signals-gcc... yes
Checking for main() in C++ library fmod-3.74.1... yes
Checking for main() in C++ library png13... no
Checking for main() in C++ library png12... yes
Checking for main() in C++ library zoidcom... yes
Checking for main() in C++ library z... yes
Checking for C++ header file zoidcom.h... yes
Checking for C++ header file fmod.h... yes
Checking for C++ header file png.h... no
Could not locate header png.h

oh, and btw: you ARE pink! Tongue
EDIT: got it with libpng-dev
MEGAEDIT: now it gives me:
Code:
sh: allegro-config: command not found
sh: allegro-config: command not found
,but continues... Is this critical?

HYPEREDIT:
Code:
root@nonsense:/home/mots/gusanos-0.9# scons
scons: Reading SConscript files ...
Configuring...
Checking for main() in C++ library boost_filesystem-gcc... yes
Checking for main() in C++ library boost_signals-gcc... yes
Checking for main() in C++ library fmod-3.74.1... yes
Checking for main() in C++ library png13... no
Checking for main() in C++ library png12... yes
Checking for main() in C++ library zoidcom... yes
Checking for main() in C++ library z... yes
Checking for C++ header file zoidcom.h... yes
Checking for C++ header file fmod.h... yes
Checking for C++ header file png.h... no
Could not locate header png.h
root@nonsense:/home/mots/gusanos-0.9# scons
scons: Reading SConscript files ...
Configuring...
Checking for main() in C++ library boost_filesystem-gcc... yes
Checking for main() in C++ library boost_signals-gcc... yes
Checking for main() in C++ library fmod-3.74.1... yes
Checking for main() in C++ library png13... no
Checking for main() in C++ library png12... yes
Checking for main() in C++ library zoidcom... yes
Checking for main() in C++ library z... yes
Checking for C++ header file zoidcom.h... yes
Checking for C++ header file fmod.h... yes
Checking for C++ header file png.h... yes
Checking for C++ header file zlib.h... yes
Checking for C++ header file boost/utility.hpp... no
Could not locate header boost/utility.hpp
root@nonsense:/home/mots/gusanos-0.9# scons
scons: Reading SConscript files ...
Configuring...
Checking for main() in C++ library boost_filesystem-gcc... yes
Checking for main() in C++ library boost_signals-gcc... yes
Checking for main() in C++ library fmod-3.74.1... yes
Checking for main() in C++ library png13... no
Checking for main() in C++ library png12... yes
Checking for main() in C++ library zoidcom... yes
Checking for main() in C++ library z... yes
Checking for C++ header file zoidcom.h... yes
Checking for C++ header file fmod.h... yes
Checking for C++ header file png.h... yes
Checking for C++ header file zlib.h... yes
Checking for C++ header file boost/utility.hpp... yes
sh: allegro-config: command not found
sh: allegro-config: command not found
scons: done reading SConscript files.
scons: Building targets ...
g++ -pipe -Wall -Wno-reorder -O3 -g -DNDEBUG -fomit-frame-pointer -IConsole -Ihttp -Iloadpng -Ilua51 -IConsole -IGUI -IUtility -IOmfgScript -c -o Console/.build/posix/release/alias.o Console/alias.cpp
g++ -pipe -Wall -Wno-reorder -O3 -g -DNDEBUG -fomit-frame-pointer -IConsole -Ihttp -Iloadpng -Ilua51 -IConsole -IGUI -IUtility -IOmfgScript -c -o Console/.build/posix/release/bindings.o Console/bindings.cpp
g++ -pipe -Wall -Wno-reorder -O3 -g -DNDEBUG -fomit-frame-pointer -IConsole -Ihttp -Iloadpng -Ilua51 -IConsole -IGUI -IUtility -IOmfgScript -c -o Console/.build/posix/release/command.o Console/command.cpp
g++ -pipe -Wall -Wno-reorder -O3 -g -DNDEBUG -fomit-frame-pointer -IConsole -Ihttp -Iloadpng -Ilua51 -IConsole -IGUI -IUtility -IOmfgScript -c -o Console/.build/posix/release/console.o Console/console.cpp
g++ -pipe -Wall -Wno-reorder -O3 -g -DNDEBUG -fomit-frame-pointer -IConsole -Ihttp -Iloadpng -Ilua51 -IConsole -IGUI -IUtility -IOmfgScript -c -o Console/.build/posix/release/consoleitem.o Console/consoleitem.cpp
g++ -pipe -Wall -Wno-reorder -O3 -g -DNDEBUG -fomit-frame-pointer -IConsole -Ihttp -Iloadpng -Ilua51 -IConsole -IGUI -IUtility -IOmfgScript -c -o Console/.build/posix/release/special_command.o Console/special_command.cpp
g++ -pipe -Wall -Wno-reorder -O3 -g -DNDEBUG -fomit-frame-pointer -IConsole -Ihttp -Iloadpng -Ilua51 -IConsole -IGUI -IUtility -IOmfgScript -c -o Console/.build/posix/release/variables.o Console/variables.cpp
g++ -pipe -Wall -Wno-reorder -O3 -g -DNDEBUG -fomit-frame-pointer -IGUI -Ihttp -Iloadpng -Ilua51 -IConsole -IGUI -IUtility -IOmfgScript -c -o GUI/detail/.build/posix/release/button.o GUI/detail/button.cpp
In file included from GUI/detail/wnd.h:5,
                 from GUI/detail/button.h:4,
                 from GUI/detail/button.cpp:1:
Utility/util/rect.h:5:21: error: allegro.h: No such file or directory
Utility/util/rect.h:21: error: expected `)' before '*' token
GUI/detail/button.cpp: In member function 'virtual bool OmfgGUI::Button::keyDown(int)':
GUI/detail/button.cpp:84: error: 'KEY_ENTER' was not declared in this scope
scons: *** [GUI/detail/.build/posix/release/button.o] Error 1
scons: building terminated because of errors.
help? I got allegro by 2dpkg -i"ing this package:http://packages.debian.org/cgi-bin/download.pl?arch=i386&file=pool%2Fmain%2Fa%2Fallegro4.2%2Fliballegro4.2_4.2.0-1_i386.deb&md5sum=00823965f436a625af8a0d7549b3f2f6&arch=i386&type=main

ULTRAEDIT: /me is an idiot and forgot to install liballegro-dev

MONSTEREDIT:
Code:
root@nonsense:/home/mots/gusanos-0.9# scons
scons: Reading SConscript files ...
scons: done reading SConscript files.
scons: Building targets ...
g++ -pipe -Wall -Wno-reorder -O3 -g -DNDEBUG -fomit-frame-pointer -IGUI -Ihttp -Iloadpng -Ilua51 -IConsole -IGUI -IUtility -IOmfgScript -c -o GUI/detail/.build/posix/release/button.o GUI/detail/button.cpp
g++ -pipe -Wall -Wno-reorder -O3 -g -DNDEBUG -fomit-frame-pointer -IGUI -Ihttp -Iloadpng -Ilua51 -IConsole -IGUI -IUtility -IOmfgScript -c -o GUI/detail/.build/posix/release/check.o GUI/detail/check.cpp
g++ -pipe -Wall -Wno-reorder -O3 -g -DNDEBUG -fomit-frame-pointer -IGUI -Ihttp -Iloadpng -Ilua51 -IConsole -IGUI -IUtility -IOmfgScript -c -o GUI/detail/.build/posix/release/context.o GUI/detail/context.cpp
g++ -pipe -Wall -Wno-reorder -O3 -g -DNDEBUG -fomit-frame-pointer -IGUI -Ihttp -Iloadpng -Ilua51 -IConsole -IGUI -IUtility -IOmfgScript -c -o GUI/detail/.build/posix/release/edit.o GUI/detail/edit.cpp
g++ -pipe -Wall -Wno-reorder -O3 -g -DNDEBUG -fomit-frame-pointer -IGUI -Ihttp -Iloadpng -Ilua51 -IConsole -IGUI -IUtility -IOmfgScript -c -o GUI/detail/.build/posix/release/group.o GUI/detail/group.cpp
g++ -pipe -Wall -Wno-reorder -O3 -g -DNDEBUG -fomit-frame-pointer -Iparsergen -Ihttp -Iloadpng -Ilua51 -IConsole -IGUI -IUtility -IOmfgScript -c -o parsergen/.build/posix/release/main.o parsergen/main.cpp
g++ -pipe -Wall -Wno-reorder -O3 -g -DNDEBUG -fomit-frame-pointer -IUtility/util -Ihttp -Iloadpng -Ilua51 -IConsole -IGUI -IUtility -IOmfgScript -c -o Utility/util/.build/posix/release/angle.o Utility/util/angle.cpp
g++ -pipe -Wall -Wno-reorder -O3 -g -DNDEBUG -fomit-frame-pointer -IUtility/util -Ihttp -Iloadpng -Ilua51 -IConsole -IGUI -IUtility -IOmfgScript -c -o Utility/util/.build/posix/release/log.o Utility/util/log.cpp
g++ -pipe -Wall -Wno-reorder -O3 -g -DNDEBUG -fomit-frame-pointer -IUtility/util -Ihttp -Iloadpng -Ilua51 -IConsole -IGUI -IUtility -IOmfgScript -c -o Utility/util/.build/posix/release/math_func.o Utility/util/math_func.cpp
g++ -pipe -Wall -Wno-reorder -O3 -g -DNDEBUG -fomit-frame-pointer -IUtility/util -Ihttp -Iloadpng -Ilua51 -IConsole -IGUI -IUtility -IOmfgScript -c -o Utility/util/.build/posix/release/text.o Utility/util/text.cpp
g++ -pipe -Wall -Wno-reorder -O3 -g -DNDEBUG -fomit-frame-pointer -IUtility/util -Ihttp -Iloadpng -Ilua51 -IConsole -IGUI -IUtility -IOmfgScript -c -o Utility/util/.build/posix/release/vec.o Utility/util/vec.cpp
ar r lib/posix/release/libomfgutil.a Utility/util/.build/posix/release/angle.o Utility/util/.build/posix/release/log.o Utility/util/.build/posix/release/math_func.o Utility/util/.build/posix/release/text.o Utility/util/.build/posix/release/vec.o
ranlib lib/posix/release/libomfgutil.a
ar: creating lib/posix/release/libomfgutil.a
g++ -o bin/posix/parsergen parsergen/.build/posix/release/main.o -Llib/posix/release -Llib/posix -lomfgutil
parserBuilderFunc(["GUI/detail/gss-grammar.h"], ["GUI/detail/gss-grammar.pg"])
Parsed file
g++ -pipe -Wall -Wno-reorder -O3 -g -DNDEBUG -fomit-frame-pointer -IGUI -Ihttp -Iloadpng -Ilua51 -IConsole -IGUI -IUtility -IOmfgScript -c -o GUI/detail/.build/posix/release/gss.o GUI/detail/gss.cpp
GUI/detail/gss-grammar.h.re: In member function 'void OmfgGUI::TGrammar<T>::next() [with T = OmfgGUI::GSSImpl]':
GUI/detail/gss.cpp:22:   instantiated from here
GUI/detail/gss-grammar.h.re:50: warning: label 'yy1' defined but not used
g++ -pipe -Wall -Wno-reorder -O3 -g -DNDEBUG -fomit-frame-pointer -IGUI -Ihttp -Iloadpng -Ilua51 -IConsole -IGUI -IUtility -IOmfgScript -c -o GUI/detail/.build/posix/release/label.o GUI/detail/label.cpp
g++ -pipe -Wall -Wno-reorder -O3 -g -DNDEBUG -fomit-frame-pointer -IGUI -Ihttp -Iloadpng -Ilua51 -IConsole -IGUI -IUtility -IOmfgScript -c -o GUI/detail/.build/posix/release/list.o GUI/detail/list.cpp
g++ -pipe -Wall -Wno-reorder -O3 -g -DNDEBUG -fomit-frame-pointer -IGUI -Ihttp -Iloadpng -Ilua51 -IConsole -IGUI -IUtility -IOmfgScript -c -o GUI/detail/.build/posix/release/renderer.o GUI/detail/renderer.cpp
g++ -pipe -Wall -Wno-reorder -O3 -g -DNDEBUG -fomit-frame-pointer -IGUI -Ihttp -Iloadpng -Ilua51 -IConsole -IGUI -IUtility -IOmfgScript -c -o GUI/detail/.build/posix/release/wnd.o GUI/detail/wnd.cpp
g++ -pipe -Wall -Wno-reorder -O3 -g -DNDEBUG -fomit-frame-pointer -IGUI -Ihttp -Iloadpng -Ilua51 -IConsole -IGUI -IUtility -IOmfgScript -c -o GUI/detail/.build/posix/release/xml.o GUI/detail/xml.cpp
g++ -pipe -Wall -Wno-reorder -O3 -g -DNDEBUG -fomit-frame-pointer -IGUI -Ihttp -Iloadpng -Ilua51 -IConsole -IGUI -IUtility -IOmfgScript -c -o GUI/lua/.build/posix/release/bindings-gui.o GUI/lua/bindings-gui.cpp
g++ -pipe -Wall -Wno-reorder -O3 -g -DNDEBUG -fomit-frame-pointer -IGoop -Ihttp -Iloadpng -Ilua51 -IConsole -IGUI -IUtility -IOmfgScript -I/usr/include -c -o Goop/.build/posix/release/2xsai.o Goop/2xsai.cpp
Goop/2xsai.cpp:68: warning: 'int GetResult1(long unsigned int, long unsigned int, long unsigned int, long unsigned int)' defined but not used
Goop/2xsai.cpp:88: warning: 'int GetResult2(long unsigned int, long unsigned int, long unsigned int, long unsigned int, long unsigned int)' defined but not usedg++ -pipe -Wall -Wno-reorder -O3 -g -DNDEBUG -fomit-frame-pointer -IGoop -Ihttp -Iloadpng -Ilua51 -IConsole -IGUI -IUtility -IOmfgScript -I/usr/include -c -o Goop/.build/posix/release/animators.o Goop/animators.cpp
In file included from Goop/sprite_set.h:4,
                 from Goop/animators.cpp:6:
Goop/resource_list.h:11:37: error: boost/filesystem/path.hpp: No such file or directory
Goop/resource_list.h:12: error: expected namespace-name before ';' token
Goop/resource_list.h:12: error: unknown namespace '<declaration error>'
Goop/resource_list.h:22: error: 'fs' has not been declared
Goop/resource_list.h:22: error: 'path' was not declared in this scope
Goop/resource_list.h:22: error: template argument 1 is invalid
Goop/resource_list.h:22: error: template argument 3 is invalid
Goop/resource_list.h:22: error: template argument 4 is invalid
Goop/resource_list.h:43: error: 'fs' has not been declared
Goop/resource_list.h:43: error: 'path' has not been declared
Goop/resource_list.h:49: error: 'fs' has not been declared
Goop/resource_list.h:49: error: 'path' has not been declared
Goop/resource_list.h:60: error: 'fs' has not been declared
Goop/resource_list.h:60: error: expected ';' before '(' token
Goop/resource_list.h:94: error: expected `;' before 'void'
Goop/resource_list.h:158: error: 'fs' has not been declared
Goop/resource_list.h:158: error: 'path' was not declared in this scope
Goop/resource_list.h:158: error: template argument 1 is invalid
Goop/resource_list.h:158: error: template argument 2 is invalid
Goop/resource_list.h: In member function 'void ResourceList<T1>::clear()':
Goop/resource_list.h:32: error: request for member 'clear' in '((ResourceList<T1>*)this)->ResourceList<T1>::m_paths', which is of non-class type 'int'
Goop/resource_list.h:33: error: 'MapT' is not a class or namespace
Goop/resource_list.h:33: error: expected initializer before 'item'
Goop/resource_list.h:34: error: 'item' was not declared in this scope
Goop/resource_list.h:34: error: request for member 'end' in '((ResourceList<T1>*)this)->ResourceList<T1>::m_resItems', which is of non-class type 'int'
Goop/resource_list.h:38: error: request for member 'clear' in '((ResourceList<T1>*)this)->ResourceList<T1>::m_resItems', which is of non-class type 'int'
Goop/resource_list.h: In member function 'void ResourceList<T1>::addPath(const int&)':
Goop/resource_list.h:45: error: request for member 'begin' in '((ResourceList<T1>*)this)->ResourceList<T1>::m_paths', which is of non-class type 'int'
Goop/resource_list.h:45: error: request for member 'end' in '((ResourceList<T1>*)this)->ResourceList<T1>::m_paths', which is of non-class type 'int'
Goop/resource_list.h:45: error: no matching function for call to 'find(<type error>, <type error>, const int&)'
Goop/resource_list.h:45: error: request for member 'end' in '((ResourceList<T1>*)this)->ResourceList<T1>::m_paths', which is of non-class type 'int'
Goop/resource_list.h:46: error: request for member 'push_back' in '((ResourceList<T1>*)this)->ResourceList<T1>::m_paths', which is of non-class type 'int'
Goop/resource_list.h: In member function 'bool ResourceList<T1>::load(const int&, T1&)':
Goop/resource_list.h:51: error: 'fs' has not been declared
Goop/resource_list.h:51: error: 'path' was not declared in this scope
Goop/resource_list.h:51: error: template argument 1 is invalid
Goop/resource_list.h:51: error: template argument 2 is invalid
Goop/resource_list.h:51: error: expected initializer before 'i'
Goop/resource_list.h:52: error: 'i' was not declared in this scope
Goop/resource_list.h:52: error: request for member 'end' in '((ResourceList<T1>*)this)->ResourceList<T1>::m_paths', which is of non-class type 'int'
Goop/resource_list.h: In member function 'void ResourceList<T1>::think()':
Goop/resource_list.h:96: error: 'MapT' is not a class or namespace
Goop/resource_list.h:96: error: expected initializer before 'i'
Goop/resource_list.h:97: error: 'i' was not declared in this scope
Goop/resource_list.h:97: error: request for member 'end' in '((ResourceList<T1>*)this)->ResourceList<T1>::m_resItems', which is of non-class type 'int'
Goop/resource_list.h: In member function 'void ResourceList<T1>::indexate()':
Goop/resource_list.h:106: error: 'MapT' is not a class or namespace
Goop/resource_list.h:106: error: expected initializer before 'item'
Goop/resource_list.h:107: error: 'item' was not declared in this scope
Goop/resource_list.h:107: error: request for member 'end' in '((ResourceList<T1>*)this)->ResourceList<T1>::m_resItems', which is of non-class type 'int'
Goop/resource_list.h: In member function 'uint32_t ResourceList<T1>::crc(bool)':Goop/resource_list.h:119: error: request for member 'begin' in 'C_119', which is of non-class type 'int'
Goop/resource_list.h:119: error: invalid type in declaration before '=' token
Goop/resource_list.h:119: error: request for member 'begin' in 'C_119', which is of non-class type 'int'
Goop/resource_list.h:119: error: request for member 'end' in 'C_119', which is of non-class type 'int'
Goop/resource_list.h:121: error: base operand of '->' is not a pointer
Goop/resource_list.h:129: error: request for member 'begin' in 'C_129', which is of non-class type 'int'
Goop/resource_list.h:129: error: invalid type in declaration before '=' token
Goop/resource_list.h:129: error: request for member 'begin' in 'C_129', which is of non-class type 'int'
Goop/resource_list.h:129: error: request for member 'end' in 'C_129', which is of non-class type 'int'
Goop/resource_list.h:131: error: base operand of '->' is not a pointer
Goop/sprite_set.h: At global scope:
Goop/sprite_set.h:15: error: expected namespace-name before ';' token
Goop/sprite_set.h:15: error: unknown namespace '<declaration error>'
Goop/sprite_set.h:31: error: 'fs' has not been declared
Goop/sprite_set.h:31: error: 'path' has not been declared
scons: *** [Goop/.build/posix/release/animators.o] Error 1
scons: building terminated because of errors.

help?!
SUPEREDIT: again, i forgot to install the -dev thingie
« Last Edit: March 18, 2006, 01:35:21 AM by mots » Logged
mots
Sr. Member
***

Karma: 0
Offline Offline

Posts: 73



View Profile
« Reply #13 on: March 18, 2006, 01:41:16 AM »

Sorry for doublepost, but the old one was to long (limit of 20000 characters)
Code:
root@nonsense:/home/mots/gusanos-0.9# scons
scons: Reading SConscript files ...
scons: done reading SConscript files.
scons: Building targets ...
[lots of uninteresting stuff...]
g++ -pipe -Wall -Wno-reorder -O3 -g -DNDEBUG -fomit-frame-pointer -IGoop -Ihttp -Iloadpng -Ilua51 -IConsole -IGUI -IUtility -IOmfgScript -I/usr/include -c -o Goop/.build/posix/release/detect_event.o Goop/detect_event.cpp
g++ -pipe -Wall -Wno-reorder -O3 -g -DNDEBUG -fomit-frame-pointer -IGoop -Ihttp -Iloadpng -Ilua51 -IConsole -IGUI -IUtility -IOmfgScript -I/usr/include -c -o Goop/.build/posix/release/distortion.o Goop/distortion.cpp
g++ -pipe -Wall -Wno-reorder -O3 -g -DNDEBUG -fomit-frame-pointer -IGoop -Ihttp -Iloadpng -Ilua51 -IConsole -IGUI -IUtility -IOmfgScript -I/usr/include -c -o Goop/.build/posix/release/encoding.o Goop/encoding.cpp
g++ -pipe -Wall -Wno-reorder -O3 -g -DNDEBUG -fomit-frame-pointer -IGoop -Ihttp -Iloadpng -Ilua51 -IConsole -IGUI -IUtility -IOmfgScript -I/usr/include -c -o Goop/.build/posix/release/events.o Goop/events.cpp
g++ -pipe -Wall -Wno-reorder -O3 -g -DNDEBUG -fomit-frame-pointer -IGoop -Ihttp -Iloadpng -Ilua51 -IConsole -IGUI -IUtility -IOmfgScript -I/usr/include -c -o Goop/.build/posix/release/exp_type.o Goop/exp_type.cpp
g++ -pipe -Wall -Wno-reorder -O3 -g -DNDEBUG -fomit-frame-pointer -IGoop -Ihttp -Iloadpng -Ilua51 -IConsole -IGUI -IUtility -IOmfgScript -I/usr/include -c -o Goop/.build/posix/release/explosion.o Goop/explosion.cpp
g++ -pipe -Wall -Wno-reorder -O3 -g -DNDEBUG -fomit-frame-pointer -IGoop -Ihttp -Iloadpng -Ilua51 -IConsole -IGUI -IUtility -IOmfgScript -I/usr/include -c -o Goop/.build/posix/release/font.o Goop/font.cpp
g++ -pipe -Wall -Wno-reorder -O3 -g -DNDEBUG -fomit-frame-pointer -IGoop -Ihttp -Iloadpng -Ilua51 -IConsole -IGUI -IUtility -IOmfgScript -I/usr/include -c -o Goop/.build/posix/release/game.o Goop/game.cpp
g++ -pipe -Wall -Wno-reorder -O3 -g -DNDEBUG -fomit-frame-pointer -IGoop -Ihttp -Iloadpng -Ilua51 -IConsole -IGUI -IUtility -IOmfgScript -I/usr/include -c -o Goop/.build/posix/release/game_actions.o Goop/game_actions.cpp
g++ -pipe -Wall -Wno-reorder -O3 -g -DNDEBUG -fomit-frame-pointer -IGoop -Ihttp -Iloadpng -Ilua51 -IConsole -IGUI -IUtility -IOmfgScript -I/usr/include -c -o Goop/.build/posix/release/gconsole.o Goop/gconsole.cpp
g++ -pipe -Wall -Wno-reorder -O3 -g -DNDEBUG -fomit-frame-pointer -IGoop -Ihttp -Iloadpng -Ilua51 -IConsole -IGUI -IUtility -IOmfgScript -I/usr/include -c -o Goop/.build/posix/release/gfx.o Goop/gfx.cpp
Goop/gfx.cpp: In member function 'void Gfx::registerInConsole()':
Goop/gfx.cpp:239: error: 'GFX_XDGA' was not declared in this scope
Goop/gfx.cpp:240: error: 'GFX_XDGA2' was not declared in this scope
Goop/gfx.cpp: In member function 'int Gfx::getGraphicsDriver()':
Goop/gfx.cpp:644: error: 'GFX_XDGA' was not declared in this scope
Goop/gfx.cpp:644: error: 'GFX_XDGA_FULLSCREEN' was not declared in this scope
Goop/gfx.cpp:645: error: 'GFX_XDGA2' was not declared in this scope
Goop/gfx.cpp:646: error: 'GFX_XWINDOWS_FULLSCREEN' was not declared in this scope
Goop/gfx.cpp:660: error: 'GFX_XDGA' was not declared in this scope
Goop/gfx.cpp:661: error: 'GFX_XDGA2' was not declared in this scope
scons: *** [Goop/.build/posix/release/gfx.o] Error 1
scons: building terminated because of errors.
« Last Edit: March 18, 2006, 01:42:32 AM by mots » Logged
setrodox
I am NOT pink!
Hero Member
*****

Karma: 34
Offline Offline

Posts: 336



View Profile
« Reply #14 on: March 18, 2006, 02:03:54 AM »

oh, and btw: you ARE pink! Tongue
i can prove that i am not! http://setrodox.liero.be  Grin

for the GFX_* errors, i can remember that some people had those too, but i can't remember what the problem was.
Logged

PINK!
Pages: [1] 2 3 4 5 ... 7 Go Up Print 
« previous next »
Jump to:  

Powered by MySQL Powered by PHP Powered by SMF 1.1.13 | SMF © 2006-2011, Simple Machines LLC Valid XHTML 1.0! Valid CSS!